{"text_format":"1","workbook":"xlsx","n_sheets":9,"sheets":["DATOS","S. CONTRATO GENERAL COMPARATIVO","S. CONTRATO GENERAL SIN COMPARA","S. CONTRATO - Actividades Artis","Propuesta - Actividades Artis","S. CONTRATO - Transporte","Propuesta - Transporte","OTROSÍ","Propuesta Productos y servicios"],"not_rendered":{"charts":0,"images":7,"macros":1,"external_links":0,"defined_names":6,"comments":0,"pivot_tables":0},"unopened":[],"bounds":{"document_bytes":16777216,"sheet_cells":100000,"rows_first":2000,"rows_last":500,"rows_between":2000,"halvings":0,"cell_chars":16384,"cell_head_chars":4096},"cells_cut":0,"cells_raw":0,"read":"whole","date_system":"1900"}

{"sheet":"DATOS","index":0,"n_rows":28,"n_cols":17,"rows_kept":28,"cut":false,"hidden":true,"merged":[]}
["Seleccione Gerencia …","Seleccione Área …","Seleccione Causal …","Seleccione ..","Seleccione ..","Seleccione mes ..","Seleccione clase de actividad …",null,"Seleccione  …","Seleccione  …","Seleccione Cuenta ..",null,"Seleccione…","Seleccione…","Seleccione Área …"]
["SUBGERENCIA ADMINISTRATIVA Y FINANCIERA","ÁREA DE FORMACIÓN Y CONTENIDOS","URGENCIA","NATURAL","CC ","ENERO","TALLERES",60000,"NIVEL CENTRAL",962,"GASTOS DE PERSONAL",1,"AUTOMOVIL","IDA Y REGRESO PUNTO A PUNTO EN BOGOTÁ PAX","ÁREA DE FORMACIÓN Y CONTENIDOS","Andres Felipe Sanabria Molina","Profesional Lider"]
["GERENCIA","ÁREA DE SERVICIOS","CUANTÍA < $3.500.000","JURÍDICA","CE ","FEBRERO","TALLERES ESPECIALIZADO",120000,"B.P GABRIEL GARCIA MARQUÉZ",946,"PLANTAS FISICAS Y MOBILIARIO",6,"CAMIONETA 4X4","TRAYECTO PUNTO A PUNTO EN BOGOTÁ PAX","ÁREA DE SERVICIOS","Rosa Elena Gómez Hurtado ","Profesional Lider"]
["OTRO. CUAL? ________________","ÁREA DE COLECCIONES","NO PLURALIDAD DE OFERENTES",null,"NIT","MARZO","CONFERENCIAS ESPECIALIZADAS, CHARLAS Y LECTURAS ($400.000 - $800.000)",null,"B.P ARBORIZADORA ALTA",960,"GESTION TIC ",5,"VAN DE 12 A 16 PAX","TRANSPORTE PAX (8 HORAS DÍA)","ÁREA DE COLECCIONES","Liliana Gutiérrez Rivera ","Profesional Lider"]
[null,"ÁREA DE BIBLIOTECA DIGITAL ","APOYO A LA GESTÍON",null,"PASAPORTE","ABRIL","PRESENTACIONES ARTISTICAS (MUSICA - DANZA - TEATRO) FORMATO GRANDE (≥ 4 PERSONAS) ($1.500.000 - $4.000.000)",null,"B.P LA MARICHUELA",965,"SERVICIOS DE INFORMACIÓN ",9,"BUESETA DE 18 A 25 PAX","TRANSPORTE PAX (8 HORAS NOCHE)","BIBLIOTECA DIGITAL ","Juan Pablo Angarita Bernal","Profesional Lider"]
[null,"ÁREA DE DIVULGACIÓN","ACTIVIDADES ARTÍSTICAS Y/O ACADÉMICAS",null,null,"MAYO","PRESENTACIONES ARTISTICAS (MUSICA - DANZA - TEATRO) FORMATO PEQUEÑO (1 A 3 PERSONAS) ($500.000 - $1.500.000)",null,"B.P SOLEDAD LAMPREA - PERDOMO",952,"PROGRAMAS DE FORMACIÓN (Lectura, Ciencia, Arte y Espacios creativos)",10,"BUS DE 30 A 40 PAX","TRANSPORTE PAX POR HORA O FRACCIÓN","ÁREA DE PLANTAS FISICAS Y MOBILIARIO ","Oscar David Camelo Romero","Profesional Lider"]
[null,"ÁREA DE PLANTAS FISICAS Y MOBILIARIO ","APROVECHAMIENTO ECONOMICO",null,null,"JUNIO",null,null,"B.P SUMAPAZ",966,"PROYECTOS ESPECIALES",11,"FURGON 1 TONELADA","IDA Y REGRESO PUNTO A PUNTO PAX - MUNICIPIOS COLINDANTES BOGOTÁ","ÁREA DE GESTION DE TIC","Marcela Rodríguez Ortiz","Profesional Lider"]
[null,"ÁREA DE GESTION DE TIC","N/A",null,null,"JULIO",null,null,"B.P PASQUILLA",967,"BIBLOVACIONES",12,"FURGON 3,5 TONELADAS","TRAYECTO PUNTO A PUNTO EN BOGOTÁ PAX - MUNICIPIOS COLINDANTES BOGOTÁ ","ÁREA ADMINISTRATIVA Y FINANCIERA","Guillermo Hernandez Patiño","Subgerente SAF"]
[null,"ÁREA DE ESPACIOS NO CONVENCIONALES",null,null,null,"AGOSTO",null,null,"B.P MANUEL ZAPATA OLIVELLA - TINTAL",950,"COLECCIONES ",8,"FURGON 9 TONELADAS","PUNTO A PUNTO TRANSPORTE DE CARGA BOGOTÁ","ÁREA DE CONTRATACIÓN ","Diego Felipe Rodriguez Pulido","Profesional Senior"]
[null,"ÁREA ADMINISTRATIVA Y FINANCIERA",null,null,null,"SEPTIEMBRE",null,null,"B.P TIMIZA",959,"BIBLIOTECA DIGITAL",13,"OTRO (Ver observaciones)","PUNTO A PUNTO TRANSPORTE DE CARGA MUNICIPIOS COLINDANTES BOGOTÁ ","ÁREA DE TALENTO HUMANO","Laura Janeth Gonzáles Torres","Profesional Lider"]
{"$rows_left_out":19}
{"sheet":"S. CONTRATO GENERAL COMPARATIVO","index":1,"n_rows":75,"n_cols":28,"rows_kept":75,"cut":false,"hidden":false,"merged":[[58,7,59,10],[58,11,58,15],[58,16,59,17],[59,2,59,4],[59,5,59,6],[74,13,74,15],[62,2,62,15],[63,14,63,15],[51,13,51,17],[47,2,47,17],[48,2,48,17],[49,2,49,6],[49,7,49,11],[49,12,49,13],[49,14,49,17],[50,2,50,9],[50,10,50,17],[64,13,64,15],[65,13,65,15],[62,16,62,17],[71,3,71,10],[64,2,64,10],[65,2,65,3],[63,16,64,17],[74,16,74,17],[65,16,65,17],[65,11,65,12],[68,3,68,10],[69,3,69,10],[70,3,70,10],[67,2,67,17],[65,4,65,5],[65,6,65,7],[65,8,65,9],[69,11,71,17],[68,11,68,17],[73,2,73,17],[74,2,74,6],[74,7,74,11],[27,4,27,5],[27,16,27,17],[28,4,28,5],[28,16,28,17],[29,4,29,5],[29,16,29,17],[34,16,34,17],[35,4,35,5],[35,16,35,17],[30,4,30,5],[30,16,30,17],[31,4,31,5],[31,16,31,17],[32,4,32,5],[32,16,32,17],[43,2,43,7],[43,8,43,9],[43,11,43,12],[63,2,63,6],[63,12,63,13],[64,11,64,12],[63,7,63,10],[59,12,59,13],[60,2,60,4],[60,5,60,6],[60,7,60,10],[60,12,60,13],[52,2,52,17],[53,2,53,17],[54,2,55,17],[56,2,57,17],[58,2,58,6],[51,8,51,10],[51,11,51,12],[45,2,46,17],[44,2,44,10],[44,13,44,14],[44,15,44,17],[51,2,51,7],[26,4,26,5],[26,16,26,17],[33,4,33,5],[33,16,33,17],[34,4,34,5],[43,16,43,17],[38,16,38,17],[39,2,39,7],[39,16,39,17],[40,2,40,7],[40,16,40,17],[41,2,41,7],[41,16,41,17],[36,2,36,7],[36,8,42,9],[36,11,42,12],[36,14,42,15],[36,16,36,17],[37,2,37,7],[37,16,37,17],[38,2,38,7],[43,14,43,15],[42,2,42,7],[42,16,42,17],[23,2,23,17],[24,2,24,7],[24,8,24,10],[24,11,24,13],[24,14,24,17],[25,4,25,5],[25,16,25,17],[17,2,17,5],[17,6,17,11],[17,14,17,17],[19,2,19,7],[19,9,19,10],[19,11,19,12],[19,13,19,14],[19,15,19,17],[20,9,20,10],[21,9,21,10],[22,9,22,10],[20,13,20,14],[21,13,21,14],[22,13,22,14],[20,11,20,12],[21,11,21,12],[22,11,22,12],[1,18,4,18],[2,14,5,17],[7,2,7,7],[7,8,7,10],[7,11,7,14],[7,15,7,17],[6,2,6,6],[2,6,5,12],[11,2,11,7],[11,8,11,12],[11,13,11,14],[11,15,11,17],[8,2,8,17],[9,2,9,17],[10,2,10,4],[10,5,10,10],[10,11,10,12],[10,13,10,17],[18,2,18,17],[20,2,20,7],[21,2,21,7],[22,2,22,7],[20,15,20,17],[21,15,21,17],[22,15,22,17],[12,2,12,4],[12,5,12,8],[12,9,12,10],[13,2,13,17],[14,2,14,17],[15,2,15,7],[15,8,15,9],[15,10,15,11],[15,12,17,12],[15,14,15,17],[16,2,16,5],[16,7,16,11],[16,14,16,17],[12,11,12,17]]}
[]
[null,null,null,null,null,null,null,null,null,null,null,null,null,null,null,null,null,null,"FIC VERSION 3. 01/01/2019"]
[null,null,null,null,null,null,"INSUMO DE CONTRATACIÓN DE BIBLORED\nREQUERIMIENTO DE CONTRATACIÓN\nÁREA CONTRACTUAL, ADMINISTRATIVA Y FINANCIERA\nPRODUCTOS Y SERVICIOS CON PLURALIDAD \nDE OFERENTES"]
[]
[]
[]
[null,null,"CONCESIÓN 159 DE 2018"]
[null,null,"FECHA DE ELABORACIÓN:",null,null,null,null,null,null,null,null,"FECHA RADICACIÓN EN SUBGERENCIA ADMINISTRATIVA Y FINANCIERA"]
[]
[null,null,"1. DATOS DE LA LÍNEA SOLICITANTE Y QUE SUPERVISARÁ EL CONTRATO"]
{"$rows_left_out":66}
{"sheet":"S. CONTRATO GENERAL SIN COMPARA","index":2,"n_rows":64,"n_cols":19,"rows_kept":64,"cut":false,"hidden":false,"merged":[[64,2,64,4],[64,5,64,10],[64,11,64,12],[64,13,64,17],[16,2,16,17],[51,16,51,17],[52,14,52,15],[53,13,53,15],[54,13,54,15],[52,16,53,17],[54,16,54,17],[63,2,63,6],[63,7,63,11],[63,13,63,15],[63,16,63,17],[62,2,62,17],[56,2,56,17],[57,3,57,10],[58,3,58,10],[40,2,40,7],[40,8,40,10],[40,11,40,12],[51,2,51,15],[59,3,59,10],[60,3,60,10],[52,2,52,6],[52,7,52,10],[52,12,52,13],[53,2,53,10],[53,11,53,12],[54,2,54,3],[54,11,54,12],[54,4,54,5],[54,6,54,7],[54,8,54,9],[58,11,60,17],[57,11,57,17],[29,13,29,14],[30,13,30,14],[31,13,31,14],[49,7,49,10],[49,12,49,13],[34,2,35,17],[49,2,49,4],[49,5,49,6],[39,2,39,10],[39,11,39,17],[29,2,29,11],[30,2,30,11],[25,15,31,17],[32,8,32,17],[25,2,25,11],[26,2,26,11],[36,2,36,17],[37,2,37,17],[38,2,38,6],[38,7,38,11],[38,12,38,13],[48,12,48,13],[24,6,24,8],[40,13,40,17],[33,2,33,10],[41,2,41,17],[42,2,42,17],[43,2,44,17],[45,2,46,17],[47,2,47,6],[47,7,48,10],[47,11,47,15],[47,16,48,17],[48,2,48,4],[48,5,48,6],[33,13,33,14],[38,14,38,17],[32,2,32,7],[31,2,31,11],[27,2,27,11],[28,2,28,11],[25,13,25,14],[26,13,26,14],[27,13,27,14],[28,13,28,14],[33,15,33,17],[21,2,21,17],[23,13,23,14],[22,2,22,17],[23,15,23,17],[24,3,24,5],[17,2,17,7],[17,9,17,10],[17,11,17,12],[17,13,17,14],[17,15,17,17],[23,3,23,5],[23,6,23,8],[24,13,24,14],[24,15,24,17],[20,2,20,7],[20,9,20,10],[20,11,20,12],[20,13,20,14],[20,15,20,17],[18,2,18,7],[18,9,18,10],[18,11,18,12],[18,13,18,14],[18,15,18,17],[1,18,4,18],[2,14,5,17],[6,2,6,17],[7,2,7,7],[7,8,7,10],[7,11,7,14],[7,15,7,17],[2,7,5,12],[13,2,13,17],[11,2,11,7],[11,8,11,12],[11,13,11,14],[11,15,11,17],[12,2,12,4],[12,5,12,8],[12,9,12,10],[12,11,12,17],[19,2,19,7],[19,9,19,10],[19,11,19,12],[19,13,19,14],[19,15,19,17],[8,2,8,17],[9,2,9,17],[10,2,10,4],[10,5,10,10],[10,11,10,12],[10,13,10,17],[14,2,14,17],[15,2,15,7],[15,8,15,9],[15,10,15,11],[15,13,15,17]]}
[]
[null,null,null,null,null,null,null,null,null,null,null,null,null,null,null,null,null,null,"FIC VERSION 3. 01/01/2019"]
[null,null,null,null,null,null,null,"INSUMO DE CONTRATACIÓN DE BIBLORED\nREQUERIMIENTO DE CONTRATACIÓN\nÁREA CONTRACTUAL, ADMINISTRATIVA Y FINANCIERA\nPRODUCTOS Y SERVICIOS SIN PLURALIDAD \nDE OFERENTES"]
[]
[]
[]
[null,null,"CONCESIÓN 159 DE 2018"]
[null,null,"FECHA DE ELABORACIÓN:",null,null,null,null,null,"2018-09-17",null,null,"FECHA RADICACIÓN EN SUBGERENCIA ADMINISTRATIVA Y FINANCIERA"]
[]
[null,null,"1. DATOS DE LA LÍNEA SOLICITANTE Y QUE SUPERVISARÁ EL CONTRATO"]
{"$rows_left_out":55}
{"sheet":"S. CONTRATO - Actividades Artis","index":3,"n_rows":65,"n_cols":17,"rows_kept":65,"cut":false,"hidden":false,"merged":[[11,9,11,15],[59,10,61,15],[58,10,58,15],[15,1,15,15],[63,1,63,16],[64,12,64,14],[64,15,64,16],[64,1,64,5],[64,6,64,10],[43,1,43,15],[53,9,53,13],[53,14,54,15],[28,1,28,4],[28,5,28,7],[28,14,28,15],[29,1,29,4],[29,5,29,7],[29,14,29,15],[51,1,52,15],[44,10,44,11],[44,12,44,15],[45,1,45,8],[49,1,50,15],[44,5,44,9],[31,1,31,4],[31,5,31,7],[31,14,31,15],[46,1,46,5],[46,9,46,10],[46,11,46,15],[47,1,47,15],[44,1,44,4],[42,1,42,15],[46,6,46,8],[37,10,37,11],[37,1,40,9],[38,10,38,13],[39,10,39,13],[40,10,40,13],[32,1,32,4],[32,5,32,7],[32,14,32,15],[57,1,57,15],[41,14,41,15],[41,1,41,13],[55,1,55,2],[55,3,55,4],[53,5,54,8],[55,5,55,8],[55,10,55,11],[53,1,53,4],[54,1,54,2],[54,3,54,4],[16,13,16,15],[20,1,20,15],[35,1,35,4],[36,1,36,4],[34,5,34,7],[35,5,35,7],[36,5,36,7],[37,14,37,15],[38,14,38,15],[26,14,26,15],[27,1,27,4],[27,5,27,7],[27,14,27,15],[30,1,30,4],[30,5,30,7],[33,1,33,4],[33,5,33,7],[33,14,33,15],[34,14,34,15],[35,14,35,15],[19,7,19,8],[21,1,21,15],[22,1,22,3],[23,1,23,4],[14,6,14,7],[14,1,14,5],[14,8,14,9],[10,13,10,15],[30,14,30,15],[58,2,58,9],[11,3,11,6],[10,1,10,5],[10,6,10,10],[11,1,11,2],[12,1,12,15],[13,1,13,15],[10,11,10,12],[11,7,11,8],[45,9,45,15],[48,1,48,15],[54,10,54,11],[16,7,16,8],[16,9,16,10],[16,11,16,12],[39,14,39,15],[17,11,17,12],[26,1,26,4],[26,5,26,7],[61,2,61,9],[0,16,3,16],[1,12,4,15],[6,1,6,5],[6,6,6,8],[1,5,4,11],[7,1,7,15],[8,1,8,15],[9,1,9,2],[9,3,9,8],[9,9,9,10],[9,11,9,15],[6,9,6,12],[6,13,6,15],[5,1,5,4],[16,1,16,5],[14,10,14,11],[14,13,14,15],[19,9,19,10],[19,13,19,15],[17,7,17,8],[18,7,18,8],[19,11,19,12],[19,1,19,5],[18,11,18,12],[17,1,17,5],[18,1,18,5],[17,9,17,10],[18,9,18,10],[17,13,17,15],[18,13,18,15],[59,2,59,9],[60,2,60,9],[40,14,40,15],[24,1,24,4],[23,5,23,7],[24,5,24,7],[25,1,25,4],[25,5,25,7],[25,14,25,15],[22,12,22,15],[22,6,22,7],[22,4,22,5],[22,8,22,10],[24,14,24,15],[23,14,23,15],[34,1,34,4],[36,14,36,15]]}
[null,null,null,null,null,null,null,null,null,null,null,null,null,null,null,null,"FIC VERSION 3. 01/01/2019"]
[null,null,null,null,null,"INSUMO DE CONTRATACIÓN DE BIBLORED\nSOLICITUD DE CONTRATACIÓN\nÁREA CONTRACTUAL, ADMINISTRATIVA Y FINANCIERA\nACTIVIDADES ARTÍSTICAS Y/O ACADÉMICAS"]
[]
[]
[]
[null,"CONCESIÓN 159 DE 2018"]
[null,"FECHA DE ELABORACIÓN:",null,null,null,null,null,null,null,"FECHA RADICACIÓN EN SUBGERENCIA ADMINISTRATIVA Y FINANCIERA"]
[]
[null,"1. DATOS DE LA LÍNEA SOLICITANTE Y QUE SUPERVISARÁ EL CONTRATO"]
[null,"GERENCIA/SUBGERENCIA:",null,"Seleccione Gerencia …",null,null,null,null,null,"ÁREA",null,"Seleccione Área …"]
{"$rows_left_out":56}
{"sheet":"Propuesta - Actividades Artis","index":4,"n_rows":16,"n_cols":15,"rows_kept":16,"cut":false,"hidden":true,"merged":[[15,0,15,11],[15,14,15,15],[13,1,13,4],[13,5,13,7],[13,14,13,15],[14,1,14,4],[14,5,14,7],[14,14,14,15],[11,1,11,4],[11,5,11,7],[11,14,11,15],[12,1,12,4],[12,5,12,7],[12,14,12,15],[9,1,9,4],[9,5,9,7],[9,14,9,15],[10,1,10,4],[10,5,10,7],[10,14,10,15],[7,1,7,4],[7,5,7,7],[7,14,7,15],[8,1,8,4],[8,5,8,7],[8,14,8,15],[5,1,5,4],[5,5,5,7],[5,14,5,15],[6,1,6,4],[6,5,6,7],[6,14,6,15],[3,1,3,4],[3,5,3,7],[3,14,3,15],[4,1,4,4],[4,5,4,7],[4,14,4,15],[0,0,0,15],[1,1,1,4],[1,5,1,7],[1,14,1,15],[2,1,2,4],[2,5,2,7],[2,14,2,15]]}
["PROPUESTA COMERCIAL Y DE SERVICIOS PARA ACTIVIDADES ARTÍSTICAS Y/O ACADÉMICAS PARA BIBLORED"]
["NOMBRE DE ACTIVIDAD","CLASE DE ACTIVIDAD",null,null,null,"BIBLIOTECA",null,null,"CE.OP","CUENTA","FECHA","HORA","CANT.\nHORAS","VALOR \nHORA","TOTAL"]
[null,"Seleccione clase de actividad …",null,null,null,"Seleccione  …",null,null,{"$f":"IFERROR(VLOOKUP(F3,DATOS!$I:$J,2,FALSE),\" \")","v":"Seleccione  …"},{"$f":"IFERROR(VLOOKUP($K$19,DATOS!$K:$L,2,FALSE),\" \")","v":" "},null,null,null,{"$f":"IFERROR(VLOOKUP(B3,DATOS!$G:$H,2,FALSE),\" \")","v":0},{"$f":"M3*N3","v":0}]
[null,"Seleccione clase de actividad …",null,null,null,"Seleccione  …",null,null,{"$f":"IFERROR(VLOOKUP(F4,DATOS!$I:$J,2,FALSE),\" \")","v":"Seleccione  …"},{"$f":"IFERROR(VLOOKUP($K$19,DATOS!$K:$L,2,FALSE),\" \")","v":" "},null,null,null,{"$f":"IFERROR(VLOOKUP(B4,DATOS!$G:$H,2,FALSE),\" \")","v":0},{"$f":"M4*N4","v":0}]
[null,"Seleccione clase de actividad …",null,null,null,"Seleccione  …",null,null,{"$f":"IFERROR(VLOOKUP(F5,DATOS!$I:$J,2,FALSE),\" \")","v":"Seleccione  …"},{"$f":"IFERROR(VLOOKUP($K$19,DATOS!$K:$L,2,FALSE),\" \")","v":" "},null,null,null,{"$f":"IFERROR(VLOOKUP(B5,DATOS!$G:$H,2,FALSE),\" \")","v":0},0]
[null,"Seleccione clase de actividad …",null,null,null,"Seleccione  …",null,null,{"$f":"IFERROR(VLOOKUP(F6,DATOS!$I:$J,2,FALSE),\" \")","v":"Seleccione  …"},{"$f":"IFERROR(VLOOKUP($K$19,DATOS!$K:$L,2,FALSE),\" \")","v":" "},null,null,null,{"$f":"IFERROR(VLOOKUP(B6,DATOS!$G:$H,2,FALSE),\" \")","v":0},0]
[null,"Seleccione clase de actividad …",null,null,null,"Seleccione  …",null,null,{"$f":"IFERROR(VLOOKUP(F7,DATOS!$I:$J,2,FALSE),\" \")","v":"Seleccione  …"},{"$f":"IFERROR(VLOOKUP($K$19,DATOS!$K:$L,2,FALSE),\" \")","v":" "},null,null,null,{"$f":"IFERROR(VLOOKUP(B7,DATOS!$G:$H,2,FALSE),\" \")","v":0},0]
[null,"Seleccione clase de actividad …",null,null,null,"Seleccione  …",null,null,{"$f":"IFERROR(VLOOKUP(F8,DATOS!$I:$J,2,FALSE),\" \")","v":"Seleccione  …"},{"$f":"IFERROR(VLOOKUP($K$19,DATOS!$K:$L,2,FALSE),\" \")","v":" "},null,null,null,{"$f":"IFERROR(VLOOKUP(B8,DATOS!$G:$H,2,FALSE),\" \")","v":0},0]
[null,"Seleccione clase de actividad …",null,null,null,"Seleccione  …",null,null,{"$f":"IFERROR(VLOOKUP(F9,DATOS!$I:$J,2,FALSE),\" \")","v":"Seleccione  …"},{"$f":"IFERROR(VLOOKUP($K$19,DATOS!$K:$L,2,FALSE),\" \")","v":" "},null,null,null,{"$f":"IFERROR(VLOOKUP(B9,DATOS!$G:$H,2,FALSE),\" \")","v":0},0]
[null,"Seleccione clase de actividad …",null,null,null,"Seleccione  …",null,null,{"$f":"IFERROR(VLOOKUP(F10,DATOS!$I:$J,2,FALSE),\" \")","v":"Seleccione  …"},{"$f":"IFERROR(VLOOKUP($K$19,DATOS!$K:$L,2,FALSE),\" \")","v":" "},null,null,null,{"$f":"IFERROR(VLOOKUP(B10,DATOS!$G:$H,2,FALSE),\" \")","v":0},0]
{"$rows_left_out":7}
{"sheet":"S. CONTRATO - Transporte","index":5,"n_rows":80,"n_cols":16,"rows_kept":80,"cut":false,"hidden":false,"merged":[[72,10,72,15],[18,9,18,15],[24,1,24,15],[79,1,79,5],[79,6,79,10],[79,12,79,13],[79,14,79,15],[40,1,40,3],[40,14,40,15],[37,1,37,3],[37,14,37,15],[38,1,38,3],[38,14,38,15],[62,1,62,4],[64,3,64,4],[64,5,64,8],[53,5,53,9],[53,10,53,11],[53,12,53,15],[44,1,44,5],[44,14,44,15],[45,1,45,5],[43,14,43,15],[39,1,39,3],[39,14,39,15],[43,1,43,3],[41,14,41,15],[42,14,42,15],[41,1,41,3],[42,1,42,3],[49,1,50,15],[56,1,56,15],[57,1,57,15],[45,14,45,15],[58,1,59,15],[55,9,55,10],[55,11,55,15],[52,1,52,15],[53,1,53,4],[46,1,46,5],[64,10,64,11],[78,1,78,15],[67,1,67,5],[67,6,67,9],[62,9,62,13],[62,14,63,15],[63,1,63,2],[62,5,63,8],[63,3,63,4],[71,1,71,15],[67,11,67,12],[72,2,72,9],[73,2,73,9],[74,2,74,9],[75,2,75,9],[68,1,68,9],[69,1,69,2],[69,10,69,11],[73,10,75,15],[69,12,69,15],[69,3,69,4],[68,10,68,11],[66,1,66,15],[67,13,67,15],[68,12,68,15],[46,14,46,15],[48,14,48,15],[44,6,47,7],[44,9,47,10],[44,12,47,13],[48,1,48,9],[48,12,48,13],[47,1,47,5],[47,14,47,15],[54,1,54,8],[54,9,54,15],[55,1,55,5],[55,6,55,8],[63,10,63,11],[64,1,64,2],[69,5,69,6],[69,7,69,8],[60,1,61,15],[16,1,16,2],[20,1,20,15],[21,6,21,7],[21,8,21,9],[21,10,23,10],[21,12,21,15],[22,1,22,3],[18,7,18,8],[16,3,16,8],[16,9,16,10],[16,11,16,15],[19,1,19,15],[17,1,17,5],[17,6,17,10],[17,11,17,12],[36,14,36,15],[33,1,33,3],[33,14,33,15],[34,1,34,3],[34,14,34,15],[31,14,31,15],[30,9,30,11],[30,12,30,15],[2,5,11,11],[2,12,11,15],[13,1,13,5],[13,6,13,8],[13,9,13,12],[13,13,13,15],[12,1,12,2],[14,1,14,15],[15,1,15,15],[31,1,31,3],[35,1,35,3],[32,1,32,3],[32,14,32,15],[36,1,36,3],[17,13,17,15],[35,14,35,15],[22,5,22,9],[22,12,22,15],[23,1,23,3],[23,4,23,9],[23,12,23,15],[29,1,29,15],[30,1,30,5],[30,6,30,8],[18,1,18,2],[18,3,18,6],[21,1,21,5],[25,1,25,6],[25,8,25,9],[25,10,25,11],[25,12,25,13],[25,14,25,15],[26,1,26,6],[28,1,28,6],[28,8,28,9],[28,10,28,11],[28,12,28,13],[28,14,28,15],[26,8,26,9],[26,10,26,11],[26,12,26,13],[26,14,26,15],[27,1,27,6],[27,8,27,9],[27,10,27,11],[27,12,27,13],[27,14,27,15]]}
[]
[]
[null,null,null,null,null,"INSUMO DE CONTRATACIÓN DE BIBLORED\nREQUERIMIENTO DE CONTRATACIÓN\nÁREA CONTRACTUAL, ADMINISTRATIVA Y FINANCIERA\nTRANSPORTE PAX O CARGA"]
[]
[]
[]
[]
[]
[]
[]
{"$rows_left_out":71}
{"sheet":"Propuesta - Transporte","index":6,"n_rows":9,"n_cols":9,"rows_kept":9,"cut":false,"hidden":true,"merged":[[7,0,7,7],[8,2,8,8],[0,0,0,8],[6,0,6,7]]}
["PROPUESTA COMERCIAL DE PRESTACIÓN DE SERVICIOS DE TRANSPORTE DE CARGA Y/O PASAJEROS"]
["SERVICIO A PRESTAR","VEHICULO","FECHA","HORA","PUNTO PARTIDA","PUNTO LLEGADA","VALOR UNITARIO","CANTIDAD","TOTAL"]
["TRANSPORTE PAX (8 HORAS DÍA)","AUTOMOVIL",null,null,null,null,null,null,{"$f":"G3*H3","v":0}]
[]
[]
[]
["TOTAL",null,null,null,null,null,null,null,{"$f":"SUM(I3:I6)","v":0}]
["NÚMERO DE COTIZACIÓN O PROPUESTA COMERCIAL:"]
[null,null,"Campos no aplican para Servicio no determinado - Presupuesto asignado a ejecutar por necesidad y según tárifa aprobada"]

{"sheet":"OTROSÍ","index":7,"n_rows":59,"n_cols":20,"rows_kept":59,"cut":false,"hidden":false,"merged":[[48,11,48,12],[29,17,29,18],[46,2,46,16],[47,14,47,16],[49,13,49,16],[48,13,48,16],[48,2,48,10],[49,2,49,3],[49,11,49,12],[49,4,49,5],[49,6,49,7],[49,8,49,9],[46,17,47,18],[48,17,49,18],[29,14,29,16],[29,11,29,13],[30,2,30,18],[31,3,31,5],[31,6,31,18],[32,3,32,5],[32,6,32,18],[7,2,7,6],[7,7,7,9],[7,10,7,14],[7,15,7,18],[1,19,5,19],[2,2,5,5],[2,6,5,14],[2,15,5,18],[6,2,6,18],[13,2,13,18],[19,2,19,18],[20,2,20,4],[20,5,20,10],[20,11,20,15],[20,16,20,18],[21,2,24,10],[21,11,21,18],[22,11,22,14],[22,15,22,18],[23,11,23,14],[23,15,23,18],[24,11,24,14],[24,15,24,18],[14,2,14,7],[14,9,14,10],[14,11,14,12],[14,13,14,14],[15,2,15,7],[15,9,15,10],[15,11,15,12],[15,13,15,14],[14,15,14,18],[15,15,15,18],[8,2,8,18],[9,2,9,18],[10,2,10,4],[10,5,10,11],[10,12,10,13],[10,14,10,18],[11,2,11,6],[11,7,11,11],[11,12,11,14],[11,15,11,18],[12,2,12,3],[12,4,12,10],[12,11,12,13],[12,14,12,18],[33,2,33,18],[34,2,34,18],[35,2,35,4],[35,5,35,7],[36,2,39,4],[36,5,39,7],[35,8,42,18],[40,2,42,4],[40,6,40,7],[41,6,41,7],[42,6,42,7],[25,2,25,18],[26,3,26,10],[26,11,26,13],[26,14,26,16],[26,17,26,18],[16,15,16,18],[17,15,17,18],[16,2,16,7],[16,9,16,10],[57,2,57,18],[58,2,58,4],[58,5,58,7],[58,8,58,9],[58,10,58,16],[58,17,58,18],[53,3,53,10],[53,11,55,17],[54,3,54,10],[55,3,55,10],[16,11,16,12],[16,13,16,14],[17,2,17,7],[17,9,17,10],[17,11,17,12],[17,13,17,14],[51,2,51,17],[52,3,52,10],[52,11,52,17],[27,3,27,10],[27,11,27,13],[27,14,27,16],[27,17,27,18],[43,2,44,4],[43,6,43,7],[44,6,44,7],[47,2,47,6],[47,7,47,10],[43,8,44,18],[47,12,47,13],[28,17,28,18],[28,3,28,10],[28,14,28,16],[28,11,28,13]]}
[]
[null,null,null,null,null,null,null,null,null,null,null,null,null,null,null,null,null,null,null,"FIC VERSION 3. 01/01/2019"]
[null,null,null,null,null,null,"INSUMO DE CONTRATACIÓN DE BIBLORED\nSOLICITUD DE OTROSÍ\nÁREA CONTRACTUAL, ADMINISTRATIVA Y FINANCIERA"]
[]
[]
[]
[]
[null,null,"FECHA DE ELABORACIÓN:",null,null,null,null,"2018-08-02",null,null,"FECHA RADICACIÓN EN SUBGERENCIA ADMINISTRATIVA Y FINANCIERA"]
[]
[null,null,"1. SUPERVISIÓN DEL CONTRATO"]
{"$rows_left_out":50}
{"sheet":"Propuesta Productos y servicios","index":8,"n_rows":27,"n_cols":14,"rows_kept":27,"cut":false,"hidden":true,"merged":[[25,0,25,9],[25,11,25,12],[26,0,26,5],[26,6,26,15],[1,0,1,4],[23,0,23,9],[23,11,23,12],[24,0,24,9],[24,11,24,12],[16,4,16,6],[16,11,16,12],[16,13,16,15],[17,1,17,3],[17,4,17,6],[17,11,17,12],[17,13,17,15],[0,0,0,15],[1,5,1,15],[21,11,21,12],[22,0,22,9],[22,11,22,12],[18,1,18,3],[18,4,18,6],[18,11,18,12],[18,13,18,15],[19,0,19,9],[19,11,19,12],[19,13,25,15],[20,0,20,9],[20,11,20,12],[21,0,21,9],[16,1,16,3],[14,1,14,3],[14,4,14,6],[14,11,14,12],[14,13,14,15],[15,1,15,3],[15,4,15,6],[15,11,15,12],[15,13,15,15],[12,1,12,3],[12,4,12,6],[12,11,12,12],[12,13,12,15],[13,1,13,3],[13,4,13,6],[13,11,13,12],[13,13,13,15],[10,1,10,3],[10,4,10,6],[10,11,10,12],[10,13,10,15],[11,1,11,3],[11,4,11,6],[11,11,11,12],[11,13,11,15],[8,1,8,3],[8,4,8,6],[8,11,8,12],[8,13,8,15],[9,1,9,3],[9,4,9,6],[9,11,9,12],[9,13,9,15],[6,4,6,6],[6,11,6,12],[6,13,6,15],[7,1,7,3],[7,4,7,6],[7,11,7,12],[7,13,7,15],[6,1,6,3],[4,1,4,3],[4,4,4,6],[4,11,4,12],[4,13,4,15],[5,1,5,3],[5,4,5,6],[5,11,5,12],[5,13,5,15],[2,1,2,3],[2,4,2,6],[2,11,2,12],[2,13,2,15],[3,1,3,3],[3,4,3,6],[3,11,3,12],[3,13,3,15]]}
["PROPUESTA COMERCIAL  PARA EL SUMINISTRO DE SERVICIOS Y/O BIENES  PARA BIBLORED"]
["Proyecto o programa:"]
["N.","BIBLIOTECA",null,null,"PRODUCTO O SERVICIO",null,null,"UNIDAD MEDIDA","MARCA","CANT.","PRECIO\nUNITARIO","PRECIO TOTAL",null,"OBSERVACIÓN"]
[null,"Seleccione  …",null,null,null,null,null,null,null,null,null,{"$f":"J4*K4","v":0}]
[null,"Seleccione  …",null,null,null,null,null,null,null,null,null,{"$f":"J5*K5","v":0}]
[null,"Seleccione  …",null,null,null,null,null,null,null,null,null,0]
[null,"Seleccione  …",null,null,null,null,null,null,null,null,null,0]
[null,"Seleccione  …",null,null,null,null,null,null,null,null,null,0]
[null,"Seleccione  …",null,null,null,null,null,null,null,null,null,0]
[null,"Seleccione  …",null,null,null,null,null,null,null,null,null,0]
{"$rows_left_out":17}